Target
Cathepsin K
Ligand
BDBM50306311
Substrate
Meas. Tech.
ChEMBL_609281 (CHEMBL1070042)
IC50
0.4±n/a nM
Citation
Target
Name:
Cathepsin K
Synonyms:
CATK_HUMAN CTSO Cathepsin O Cathepsin X
Type:
Enzyme
Mol. Mass.:
36975.68
Organism:
Homo sapiens (Human)
Description:
P43235
Residue:
329
  
Inhibitor
Name:
BDBM50306311
Synonyms:
(S)-N-(1-cyanocyclopropyl)-4-fluoro-4-methyl-2-((S)-2,2,2-trifluoro-1-(4-(quinolin-6-yl)phenyl)ethylamino)pentanamide | CHEMBL605341
Type:
Small organic molecule
Emp. Form.:
C27H26F4N4O
Mol. Mass.:
498.5152
SMILES:
CC(C)(F)C[C@H](N[C@@H](c1ccc(cc1)-c1ccc2ncccc2c1)C(F)(F)F)C(=O)NC1(CC1)C#N
: