Target
Hypoxia-inducible factor 1-alpha
Ligand
BDBM50306564
Substrate
Meas. Tech.
ChEMBL_610892 (CHEMBL1065047)
IC50
90600±n/a nM
Citation
 Shimizu, KMaruyama, MYasui, YMinegishi, HBan, HSNakamura, H Boron-containing phenoxyacetanilide derivatives as hypoxia-inducible factor (HIF)-1alpha inhibitors. Bioorg Med Chem Lett 20:1453-6 (2010)  
Target
Name:
Hypoxia-inducible factor 1-alpha
Synonyms:
BHLHE78 HIF-1-alpha, HIF-2-alpha HIF1A_HUMAN Hypoxia-inducible factor 1 alpha MOP1 von Hippel-Lindau disease tumor suppressor/Elongin-C/Elongin-B/HIF1A
Type:
Protein
Mol. Mass.:
92647.24
Organism:
Homo sapiens (Human)
Description:
Q16665
Residue:
826
  
Inhibitor
Name:
BDBM50306564
Synonyms:
CHEMBL603103 | N-(2-hydroxy-5-(4,4,5,5-tetramethyl-1,3,2-dioxaborolan-2-yl)phenyl)-2-(p-tolyloxy)acetamide
Type:
Small organic molecule
Emp. Form.:
C21H26BNO5
Mol. Mass.:
383.246
SMILES:
Cc1ccc(OCC(=O)Nc2cc(ccc2O)B2OC(C)(C)C(C)(C)O2)cc1
: