Target
Serine/threonine-protein kinase mTOR
Ligand
BDBM50306621
Substrate
Meas. Tech.
ChEMBL_611243 (CHEMBL1068272)
IC50
0.26±n/a nM
Citation
 Curran, KJVerheijen, JCKaplan, JRichard, DJToral-Barza, LHollander, ILucas, JAyral-Kaloustian, SYu, KZask, A Pyrazolopyrimidines as highly potent and selective, ATP-competitive inhibitors of the mammalian target of rapamycin (mTOR): optimization of the 1-substituent. Bioorg Med Chem Lett 20:1440-4 (2010)  
Target
Name:
Serine/threonine-protein kinase mTOR
Synonyms:
FK506-binding protein 12-rapamycin complex-associated protein 1 FRAP FRAP1 MTOR Mammalian Target of Rapamycin (mTOR) RAFT1 Rapamycin and FKBP12 target 1 Serine/threonine-protein kinase (mTOR) | mTORC2
Type:
Rapamycin target protein
Mol. Mass.:
288917.12
Organism:
Homo sapiens (Human)
Description:
P42345
Residue:
2549
  
Inhibitor
Name:
BDBM50306621
Synonyms:
CHEMBL600084 | tert-butyl 4-(4-(8-oxa-3-azabicyclo[3.2.1]octan-3-yl)-6-(4-(3-methylureido)phenyl)-1H-pyrazolo[3,4-d]pyrimidin-1-yl)piperidine-1-carboxylate
Type:
Small organic molecule
Emp. Form.:
C29H38N8O4
Mol. Mass.:
562.6632
SMILES:
CNC(=O)Nc1ccc(cc1)-c1nc(N2CC3CCC(C2)O3)c2cnn(C3CCN(CC3)C(=O)OC(C)(C)C)c2n1
: