Target
Serine/threonine-protein kinase mTOR
Ligand
BDBM50306623
Substrate
Meas. Tech.
ChEMBL_611243 (CHEMBL1068272)
IC50
0.74±n/a nM
Citation
 Curran, KJVerheijen, JCKaplan, JRichard, DJToral-Barza, LHollander, ILucas, JAyral-Kaloustian, SYu, KZask, A Pyrazolopyrimidines as highly potent and selective, ATP-competitive inhibitors of the mammalian target of rapamycin (mTOR): optimization of the 1-substituent. Bioorg Med Chem Lett 20:1440-4 (2010)  
Target
Name:
Serine/threonine-protein kinase mTOR
Synonyms:
FK506-binding protein 12-rapamycin complex-associated protein 1 FRAP FRAP1 MTOR Mammalian Target of Rapamycin (mTOR) RAFT1 Rapamycin and FKBP12 target 1 Serine/threonine-protein kinase (mTOR) | mTORC2
Type:
Rapamycin target protein
Mol. Mass.:
288917.12
Organism:
Homo sapiens (Human)
Description:
P42345
Residue:
2549
  
Inhibitor
Name:
BDBM50306623
Synonyms:
1-(4-(4-(8-oxa-3-azabicyclo[3.2.1]octan-3-yl)-1-ethyl-1H-pyrazolo[3,4-d]pyrimidin-6-yl)phenyl)-3-methylurea | CHEMBL600811
Type:
Small organic molecule
Emp. Form.:
C21H25N7O2
Mol. Mass.:
407.4689
SMILES:
CCn1ncc2c(nc(nc12)-c1ccc(NC(=O)NC)cc1)N1CC2CCC(C1)O2
: