Target
Beta-1 adrenergic receptor
Ligand
BDBM50306809
Substrate
Meas. Tech.
ChEMBL_611945 (CHEMBL1071506)
EC50
>1000±n/a nM
Citation
 Bouyssou, THoenke, CRudolf, KLustenberger, PPestel, SSieger, PLotz, RHeine, CBüttner, FHSchnapp, AKonetzki, I Discovery of olodaterol, a novel inhaled beta2-adrenoceptor agonist with a 24 h bronchodilatory efficacy. Bioorg Med Chem Lett 20:1410-4 (2010)  
Target
Name:
Beta-1 adrenergic receptor
Synonyms:
ADRB1 ADRB1_HUMAN Beta-1 adrenoceptor adrenergic Beta1
Type:
G Protein-Coupled Receptor (GPCR)
Mol. Mass.:
51338.40
Organism:
Homo sapiens (Human)
Description:
P08588
Residue:
477
  
Inhibitor
Name:
BDBM50306809
Synonyms:
CHEMBL601429 | rac-8-(2-(1-(3,5-difluorophenyl)-2-methylpropan-2-ylamino)-1-hydroxyethyl)-6-hydroxy-2H-benzo[b][1,4]oxazin-3(4H)-one
Type:
Small organic molecule
Emp. Form.:
C20H22F2N2O4
Mol. Mass.:
392.3965
SMILES:
CC(C)(Cc1cc(F)cc(F)c1)NCC(O)c1cc(O)cc2NC(=O)COc12
: