Target
Cyclin-A1/Cyclin-A2/Cyclin-dependent kinase 2
Ligand
BDBM50307551
Substrate
Meas. Tech.
ChEMBL_611970 (CHEMBL1072177)
IC50
104±n/a nM
Citation
 Traquandi, GCiomei, MBallinari, DCasale, EColombo, NCroci, VFiorentini, FIsacchi, ALongo, AMercurio, CPanzeri, APastori, WPevarello, PVolpi, DRoussel, PVulpetti, ABrasca, MG Identification of potent pyrazolo[4,3-h]quinazoline-3-carboxamides as multi-cyclin-dependent kinase inhibitors. J Med Chem 53:2171-87 (2010)  
Target
Name:
Cyclin-A1/Cyclin-A2/Cyclin-dependent kinase 2
Synonyms:
CDK2/Cyclin A/Cyclin A1 Cyclin-dependent kinase 2/cyclin A
Type:
Mol. Mass.:
Description:
ASSAY_ID of EBI is 42813
Components:
This complex has 3 components.
Component 1
Name:
Cyclin-A2
Synonyms:
CCN1 CCNA1 CCNA2_HUMAN Cyclin-A
Type:
Enzyme Subunit
Mol. Mass.:
48550.19
Organism:
Homo sapiens (Human)
Description:
P20248
Residue:
432
  
Component 2
Name:
Cyclin-A1
Synonyms:
CCNA1 CDK2/Cyclin A1 Cyclin-A1/Cyclin-dependent kinase 4
Type:
Enzyme
Mol. Mass.:
52343.37
Organism:
Homo sapiens (Human)
Description:
P78396
Residue:
465
  
Component 3
Name:
Cyclin-dependent kinase 2
Synonyms:
CDK2 CDK2_HUMAN Cell division protein kinase 2 Protein cereblon/Cyclin-dependent kinase 2 | p33 protein kinase
Type:
Enzyme Subunit
Mol. Mass.:
33938.17
Organism:
Homo sapiens (Human)
Description:
P24941
Residue:
298
  
Component 4
Name:
Cyclin-A2
Synonyms:
CCN1 CCNA1 CCNA2_HUMAN Cyclin-A
Type:
Enzyme Subunit
Mol. Mass.:
48550.19
Organism:
Homo sapiens (Human)
Description:
P20248
Residue:
432
  
Inhibitor
Name:
BDBM50307551
Synonyms:
1-Methyl-8-{[3-(4-methylpiperazin-1-yl)benzyl]amino}-4,5-dihydro-1H-pyrazolo[4,3-h]quinazoline-3-carboxamide | CHEMBL605350
Type:
Small organic molecule
Emp. Form.:
C23H28N8O
Mol. Mass.:
432.5214
SMILES:
CN1CCN(CC1)c1cccc(CNc2ncc3CCc4c(nn(C)c4-c3n2)C(N)=O)c1
: