Target
Aurora kinase A
Ligand
BDBM50307551
Substrate
Meas. Tech.
ChEMBL_611972 (CHEMBL1072179)
IC50
2136±n/a nM
Citation
 Traquandi, GCiomei, MBallinari, DCasale, EColombo, NCroci, VFiorentini, FIsacchi, ALongo, AMercurio, CPanzeri, APastori, WPevarello, PVolpi, DRoussel, PVulpetti, ABrasca, MG Identification of potent pyrazolo[4,3-h]quinazoline-3-carboxamides as multi-cyclin-dependent kinase inhibitors. J Med Chem 53:2171-87 (2010)  
Target
Name:
Aurora kinase A
Synonyms:
AIK ARK-1 AURA AURKA_HUMAN Aurora 2 Aurora kinase A (AURKA) Aurora kinase A (Aurora-2) Aurora/IPL1-related kinase 1 Breast tumor-amplified kinase IAK1 STK15 GN Serine/threonine kinase 15 Serine/threonine-protein kinase 6 Serine/threonine-protein kinase aurora-A aurora-2 | hARK1
Type:
Serine/threonine-protein kinase
Mol. Mass.:
45830.98
Organism:
Homo sapiens (Human)
Description:
O14965
Residue:
403
  
Inhibitor
Name:
BDBM50307551
Synonyms:
1-Methyl-8-{[3-(4-methylpiperazin-1-yl)benzyl]amino}-4,5-dihydro-1H-pyrazolo[4,3-h]quinazoline-3-carboxamide | CHEMBL605350
Type:
Small organic molecule
Emp. Form.:
C23H28N8O
Mol. Mass.:
432.5214
SMILES:
CN1CCN(CC1)c1cccc(CNc2ncc3CCc4c(nn(C)c4-c3n2)C(N)=O)c1
: