Target
Bcl-2-like protein 1
Ligand
BDBM50308111
Substrate
Meas. Tech.
ChEMBL_610765 (CHEMBL1064400)
Ki
>100000±n/a nM
Citation
 Bernardo, PHSivaraman, TWan, KFXu, JKrishnamoorthy, JSong, CMTian, LChin, JSLim, DSMok, HYYu, VCTong, JCChai, CL Structural insights into the design of small molecule inhibitors that selectively antagonize Mcl-1. J Med Chem 53:2314-8 (2010)  
Target
Name:
Bcl-2-like protein 1
Synonyms:
Anti-apoptotic Bcl-2 protein Apoptosis regulator Bcl-X BCL2-like 1 isoform 1 BCL2L1 Bcl-2-like protein 1 (Bcl-XL) Bcl-xL/Bcl-2-binding component 3 Bcl2-antagonist of cell death (BAD)
Type:
Mitochondrion membrane; Single-pass membrane protein
Mol. Mass.:
26039.60
Organism:
Homo sapiens (Human)
Description:
Residue:
233
  
Inhibitor
Name:
BDBM50308111
Synonyms:
(S,Z)-2-(5-((6-(3,4-dimethoxyphenyl)pyridin-3-yl)methylene)-4-oxo-2-thioxothiazolidin-3-yl)-3-phenylpropanoic acid | CHEMBL596599
Type:
Small organic molecule
Emp. Form.:
C26H22N2O5S2
Mol. Mass.:
506.593
SMILES:
COc1ccc(cc1OC)-c1ccc(\C=C2/SC(=S)N([C@@H](Cc3ccccc3)C(O)=O)C2=O)cn1
: