Target
Induced myeloid leukemia cell differentiation protein Mcl-1
Ligand
BDBM50308111
Substrate
Meas. Tech.
ChEMBL_610766 (CHEMBL1064401)
Kd
8000±n/a nM
Citation
 Bernardo, PHSivaraman, TWan, KFXu, JKrishnamoorthy, JSong, CMTian, LChin, JSLim, DSMok, HYYu, VCTong, JCChai, CL Structural insights into the design of small molecule inhibitors that selectively antagonize Mcl-1. J Med Chem 53:2314-8 (2010)  
Target
Name:
Induced myeloid leukemia cell differentiation protein Mcl-1
Synonyms:
BCL2L3 Bcl-2-like protein 3 (Mcl-1) Bcl2-L-3 MCL1 Mcl-1 Myeloid cell leukemia sequence 1 (BCL2-related) | mcl1/EAT
Type:
Membrane; Single-pass membrane protein
Mol. Mass.:
37332.87
Organism:
Homo sapiens (Human)
Description:
Q07820
Residue:
350
  
Inhibitor
Name:
BDBM50308111
Synonyms:
(S,Z)-2-(5-((6-(3,4-dimethoxyphenyl)pyridin-3-yl)methylene)-4-oxo-2-thioxothiazolidin-3-yl)-3-phenylpropanoic acid | CHEMBL596599
Type:
Small organic molecule
Emp. Form.:
C26H22N2O5S2
Mol. Mass.:
506.593
SMILES:
COc1ccc(cc1OC)-c1ccc(\C=C2/SC(=S)N([C@@H](Cc3ccccc3)C(O)=O)C2=O)cn1
: