Target
Thromboxane A2 receptor
Ligand
BDBM50308124
Substrate
Meas. Tech.
ChEMBL_610070 (CHEMBL1072479)
Ki
>7282±n/a nM
Citation
 Blouin, MHan, YBurch, JFarand, JMellon, CGaudreault, MWrona, MLévesque, JFDenis, DMathieu, MCStocco, RVigneault, ETherien, AClark, PRowland, SXu, DO'Neill, GDucharme, YFriesen, R The discovery of 4-{1-[({2,5-dimethyl-4-[4-(trifluoromethyl)benzyl]-3-thienyl}carbonyl)amino]cyclopropyl}benzoic acid (MK-2894), a potent and selective prostaglandin E2 subtype 4 receptor antagonist. J Med Chem 53:2227-38 (2010)  
Target
Name:
Thromboxane A2 receptor
Synonyms:
Prostanoid TP receptor TBXA2R Thromboxane Thromboxane Beta
Type:
Enyzme
Mol. Mass.:
37445.28
Organism:
Homo sapiens (Human)
Description:
P21731
Residue:
343
  
Inhibitor
Name:
BDBM50308124
Synonyms:
4-[(1S)-1-({[4-(3-Chlorobenzyl)-3-thienyl]carbonyl}amino)ethyl]-benzoic Acid | CHEMBL599051
Type:
Small organic molecule
Emp. Form.:
C21H18ClNO3S
Mol. Mass.:
399.891
SMILES:
C[C@H](NC(=O)c1cscc1Cc1cccc(Cl)c1)c1ccc(cc1)C(O)=O
: