Target
Transient receptor potential cation channel subfamily V member 1
Ligand
BDBM50142759
Substrate
Meas. Tech.
ChEMBL_607256 (CHEMBL1070096)
IC50
50±n/a nM
Citation
 Chang, MPark, SRKim, JJang, MPark, JHPark, JEPark, HGSuh, YGJeong, YSPark, YHKim, HD Silicon switch approach in TRPV1 antagonist MK-056 and its analogues. Bioorg Med Chem 18:111-6 (2010)  
Target
Name:
Transient receptor potential cation channel subfamily V member 1
Synonyms:
Capsaicin receptor TRPV1_RAT Trpv1 Vanilloid VR1 Vanilloid receptor 1 (VRI/TRPV1) Vanilloid receptor type 1-like (TrpV1/Vr1) Vr1l | osm-9-like TRP channel 1
Type:
Transient Receptor
Mol. Mass.:
94956.12
Organism:
Rattus norvegicus (rat)
Description:
O35433
Residue:
838
  
Inhibitor
Name:
BDBM50142759
Synonyms:
(R)-N-(4-(1-(3-(4-tert-butylbenzyl)thioureido)ethyl)phenyl)methanesulfonamide N-(4-tert-butylbenzyl)-N'-{(1R)-1-[4-(methylsulfonylamino)phenyl]ethyl}thiourea | N-(4-{(R)-1-[3-(4-tert-Butyl-benzyl)-thioureido]-ethyl}-phenyl)-methanesulfonamide
Type:
Small organic molecule
Emp. Form.:
C21H29N3O2S2
Mol. Mass.:
419.604
SMILES:
C[C@@H](NC(=S)NCc1ccc(cc1)C(C)(C)C)c1ccc(NS(C)(=O)=O)cc1
: