Target
Carbonyl reductase [NADPH] 1
Ligand
BDBM50308751
Substrate
Meas. Tech.
ChEMBL_607770 (CHEMBL1068741)
IC50
4000±n/a nM
Citation
 Berhe, SSlupe, ALuster, CCharlier, HAWarner, DLZalkow, LHBurgess, EMEnwerem, NMBakare, O Synthesis of 3-[(N-carboalkoxy)ethylamino]-indazole-dione derivatives and their biological activities on human liver carbonyl reductase. Bioorg Med Chem 18:134-41 (2010)  
Target
Name:
Carbonyl reductase [NADPH] 1
Synonyms:
CBR CBR1_HUMAN SDR21C1
Type:
PROTEIN
Mol. Mass.:
30380.63
Organism:
Homo sapiens (Human)
Description:
ChEMBL_607770
Residue:
277
  
Inhibitor
Name:
BDBM50308751
Synonyms:
3-(methyl-N-ethylcarbamate)-6-(N0-ethylphenylamino)indazol-4,7-dione | CHEMBL589095
Type:
Small organic molecule
Emp. Form.:
C19H20N4O4
Mol. Mass.:
368.3865
SMILES:
CCN(c1ccccc1)c1cc(O)c2c(CC=NC(=O)OC)n[nH]c2c1O
: