Target
Carbonyl reductase [NADPH] 1
Ligand
BDBM50308754
Substrate
Meas. Tech.
ChEMBL_607770 (CHEMBL1068741)
IC50
5000±n/a nM
Citation
 Berhe, SSlupe, ALuster, CCharlier, HAWarner, DLZalkow, LHBurgess, EMEnwerem, NMBakare, O Synthesis of 3-[(N-carboalkoxy)ethylamino]-indazole-dione derivatives and their biological activities on human liver carbonyl reductase. Bioorg Med Chem 18:134-41 (2010)  
Target
Name:
Carbonyl reductase [NADPH] 1
Synonyms:
CBR CBR1_HUMAN SDR21C1
Type:
PROTEIN
Mol. Mass.:
30380.63
Organism:
Homo sapiens (Human)
Description:
ChEMBL_607770
Residue:
277
  
Inhibitor
Name:
BDBM50308754
Synonyms:
3-(Methyl-N-ethylcarbamate)-6,7-dichloro-5,8-dimethoxybenz[f]indazol-4,9-dione | CHEMBL591062
Type:
Small organic molecule
Emp. Form.:
C17H15Cl2N3O6
Mol. Mass.:
428.224
SMILES:
COC(=O)NCCc1n[nH]c2c1C(=O)c1c(OC)c(Cl)c(Cl)c(OC)c1C2=O
: