Target
Prostaglandin D2 receptor 2
Ligand
BDBM50309254
Substrate
Meas. Tech.
ChEMBL_609122 (CHEMBL1066570)
IC50
550±n/a nM
Citation
 Grimstrup, MRist, ØReceveur, JMFrimurer, TMUlven, TMathiesen, JMKostenis, EHögberg, T Novel selective thiazoleacetic acids as CRTH2 antagonists developed from in silico derived hits. Part 2. Bioorg Med Chem Lett 20:1181-5 (2010)  
Target
Name:
Prostaglandin D2 receptor 2
Synonyms:
CD_antigen=CD294 Chemoattractant Receptor-homologous molecule expressed on T-helper type 2 cells (CRTH2) Chemoattractant receptor-homologous molecule expressed on Th2 cells (CRTH2) G protein-coupled receptor 44 GPR44 PTGDR2 Prostaglandin D2 receptor 2 | Prostaglandin D2 receptor 2 (PGD2)
Type:
Enzyme
Mol. Mass.:
43295.45
Organism:
Homo sapiens (Human)
Description:
Q9Y5Y4
Residue:
395
  
Inhibitor
Name:
BDBM50309254
Synonyms:
2-(4-(4-chlorophenyl)-2-phenylthiazol-5-yl)acetic acid | CHEMBL589092
Type:
Small organic molecule
Emp. Form.:
C17H12ClNO2S
Mol. Mass.:
329.801
SMILES:
OC(=O)Cc1sc(nc1-c1ccc(Cl)cc1)-c1ccccc1
: