Target
Adenosine receptor A2a
Ligand
BDBM50309477
Substrate
Meas. Tech.
ChEMBL_609496 (CHEMBL1071768)
Ki
5491±n/a nM
Citation
 Beattie, DBrearley, ABrown, ZCharlton, SJCox, BFairhurst, RAFozard, JRGedeck, PKirkham, PMeja, KNanson, LNeef, JOakman, HSpooner, GTaylor, RJTurner, RJWest, RWoodward, H Synthesis and evaluation of two series of 4'-aza-carbocyclic nucleosides as adenosine A2A receptor agonists. Bioorg Med Chem Lett 20:1219-24 (2010)  
Target
Name:
Adenosine receptor A2a
Synonyms:
A2A adenosine receptor (hA2A) ADENOSINE A2 ADORA2 Adenosine A2A receptor (A2AAR)
Type:
G Protein-Coupled Receptor (GPCR)
Mol. Mass.:
44716.46
Organism:
Homo sapiens (Human)
Description:
P29274
Residue:
412
  
Inhibitor
Name:
BDBM50309477
Synonyms:
1-((2S,3S,4R,5R)-5-(6-amino-2-((S)-1-hydroxy-3-phenylpropan-2-ylamino)-9H-purin-9-yl)-3,4-dihydroxytetrahydrofuran-2-yl)pyridin-2(1H)-one | CHEMBL590392
Type:
Small organic molecule
Emp. Form.:
C24H27N7O4
Mol. Mass.:
477.5157
SMILES:
Nc1nc(N[C@H](CO)Cc2ccccc2)nc2n(cnc12)[C@@H]1C[C@@H]([C@@H](O)[C@H]1O)n1ccccc1=O
: