Target
Adenosine receptor A2a
Ligand
BDBM50309482
Substrate
Meas. Tech.
ChEMBL_609496 (CHEMBL1071768)
Ki
8±n/a nM
Citation
 Beattie, DBrearley, ABrown, ZCharlton, SJCox, BFairhurst, RAFozard, JRGedeck, PKirkham, PMeja, KNanson, LNeef, JOakman, HSpooner, GTaylor, RJTurner, RJWest, RWoodward, H Synthesis and evaluation of two series of 4'-aza-carbocyclic nucleosides as adenosine A2A receptor agonists. Bioorg Med Chem Lett 20:1219-24 (2010)  
Target
Name:
Adenosine receptor A2a
Synonyms:
A2A adenosine receptor (hA2A) ADENOSINE A2 ADORA2 Adenosine A2A receptor (A2AAR)
Type:
G Protein-Coupled Receptor (GPCR)
Mol. Mass.:
44716.46
Organism:
Homo sapiens (Human)
Description:
P29274
Residue:
412
  
Inhibitor
Name:
BDBM50309482
Synonyms:
CHEMBL592540 | N-((2S,3S,4R,5R)-3,4-dihydroxy-5-(2-(2-(1-isopropyl-1H-imidazol-4-yl)ethylamino)-6-(pentan-3-ylamino)-9H-purin-9-yl)tetrahydrofuran-2-yl)propionamide
Type:
Small organic molecule
Emp. Form.:
C26H41N9O3
Mol. Mass.:
527.6622
SMILES:
CCC(CC)Nc1nc(NCCc2cn(cn2)C(C)C)nc2n(cnc12)[C@@H]1C[C@H](NC(=O)CC)[C@@H](O)[C@H]1O
: