Target
Adenosine receptor A2a
Ligand
BDBM50309485
Substrate
Meas. Tech.
ChEMBL_609496 (CHEMBL1071768)
Ki
382±n/a nM
Citation
 Beattie, DBrearley, ABrown, ZCharlton, SJCox, BFairhurst, RAFozard, JRGedeck, PKirkham, PMeja, KNanson, LNeef, JOakman, HSpooner, GTaylor, RJTurner, RJWest, RWoodward, H Synthesis and evaluation of two series of 4'-aza-carbocyclic nucleosides as adenosine A2A receptor agonists. Bioorg Med Chem Lett 20:1219-24 (2010)  
Target
Name:
Adenosine receptor A2a
Synonyms:
A2A adenosine receptor (hA2A) ADENOSINE A2 ADORA2 Adenosine A2A receptor (A2AAR)
Type:
G Protein-Coupled Receptor (GPCR)
Mol. Mass.:
44716.46
Organism:
Homo sapiens (Human)
Description:
P29274
Residue:
412
  
Inhibitor
Name:
BDBM50309485
Synonyms:
CHEMBL601081 | N-((2S,3S,4R,5R)-5-(6-(2,2-diphenylethylamino)-2-(2-(1-isopropyl-1H-imidazol-4-yl)ethylamino)-9H-purin-9-yl)-3,4-dihydroxytetrahydrofuran-2-yl)pivalamide
Type:
Small organic molecule
Emp. Form.:
C37H47N9O3
Mol. Mass.:
665.8276
SMILES:
CC(C)n1cnc(CCNc2nc(NCC(c3ccccc3)c3ccccc3)c3ncn([C@@H]4C[C@H](NC(=O)C(C)(C)C)[C@@H](O)[C@H]4O)c3n2)c1
: