Target
Adenosine receptor A2a
Ligand
BDBM50309493
Substrate
Meas. Tech.
ChEMBL_609496 (CHEMBL1071768)
Ki
34±n/a nM
Citation
 Beattie, DBrearley, ABrown, ZCharlton, SJCox, BFairhurst, RAFozard, JRGedeck, PKirkham, PMeja, KNanson, LNeef, JOakman, HSpooner, GTaylor, RJTurner, RJWest, RWoodward, H Synthesis and evaluation of two series of 4'-aza-carbocyclic nucleosides as adenosine A2A receptor agonists. Bioorg Med Chem Lett 20:1219-24 (2010)  
Target
Name:
Adenosine receptor A2a
Synonyms:
A2A adenosine receptor (hA2A) ADENOSINE A2 ADORA2 Adenosine A2A receptor (A2AAR)
Type:
G Protein-Coupled Receptor (GPCR)
Mol. Mass.:
44716.46
Organism:
Homo sapiens (Human)
Description:
P29274
Residue:
412
  
Inhibitor
Name:
BDBM50309493
Synonyms:
(2R,3R,4S,5S)-2-(2-(2-(1-ethyl-1H-imidazol-4-yl)ethylamino)-6-(2-ethylbutylamino)-9H-purin-9-yl)-5-(4-ethyl-1H-pyrazol-1-yl)tetrahydrofuran-3,4-diol | CHEMBL596904
Type:
Small organic molecule
Emp. Form.:
C28H42N10O2
Mol. Mass.:
550.6989
SMILES:
CCC(CC)CNc1nc(NCCc2cn(CC)cn2)nc2n(cnc12)[C@@H]1C[C@@H]([C@@H](O)[C@H]1O)n1cc(CC)cn1
: