Target
Adenosine receptor A2a
Ligand
BDBM50309494
Substrate
Meas. Tech.
ChEMBL_609497 (CHEMBL1071769)
IC50
5.3±n/a nM
Citation
 Beattie, DBrearley, ABrown, ZCharlton, SJCox, BFairhurst, RAFozard, JRGedeck, PKirkham, PMeja, KNanson, LNeef, JOakman, HSpooner, GTaylor, RJTurner, RJWest, RWoodward, H Synthesis and evaluation of two series of 4'-aza-carbocyclic nucleosides as adenosine A2A receptor agonists. Bioorg Med Chem Lett 20:1219-24 (2010)  
Target
Name:
Adenosine receptor A2a
Synonyms:
A2A adenosine receptor (hA2A) ADENOSINE A2 ADORA2 Adenosine A2A receptor (A2AAR)
Type:
G Protein-Coupled Receptor (GPCR)
Mol. Mass.:
44716.46
Organism:
Homo sapiens (Human)
Description:
P29274
Residue:
412
  
Inhibitor
Name:
BDBM50309494
Synonyms:
(1R,2S,3R,5S)-3-(2-(2-(1-ethyl-1H-imidazol-4-yl)ethylamino)-6-(2-ethylbutylamino)-9H-purin-9-yl)-5-(4-(hydroxymethyl)-1H-pyrazol-1-yl)cyclopentane-1,2-diol | CHEMBL604591
Type:
Small organic molecule
Emp. Form.:
C27H40N10O3
Mol. Mass.:
552.6717
SMILES:
CCC(CC)CNc1nc(NCCc2cn(CC)cn2)nc2n(cnc12)[C@@H]1C[C@@H]([C@@H](O)[C@H]1O)n1cc(CO)cn1
: