Target
Adenosine receptor A2a
Ligand
BDBM50309496
Substrate
Meas. Tech.
ChEMBL_609497 (CHEMBL1071769)
IC50
12±n/a nM
Citation
 Beattie, DBrearley, ABrown, ZCharlton, SJCox, BFairhurst, RAFozard, JRGedeck, PKirkham, PMeja, KNanson, LNeef, JOakman, HSpooner, GTaylor, RJTurner, RJWest, RWoodward, H Synthesis and evaluation of two series of 4'-aza-carbocyclic nucleosides as adenosine A2A receptor agonists. Bioorg Med Chem Lett 20:1219-24 (2010)  
Target
Name:
Adenosine receptor A2a
Synonyms:
A2A adenosine receptor (hA2A) ADENOSINE A2 ADORA2 Adenosine A2A receptor (A2AAR)
Type:
G Protein-Coupled Receptor (GPCR)
Mol. Mass.:
44716.46
Organism:
Homo sapiens (Human)
Description:
P29274
Residue:
412
  
Inhibitor
Name:
BDBM50309496
Synonyms:
CHEMBL591999 | N-((1S,2R,3S,4R)-4-(6-amino-2-(hex-1-ynyl)-9H-purin-9-yl)-2,3-dihydroxycyclopentyl)propionamide
Type:
Small organic molecule
Emp. Form.:
C19H26N6O3
Mol. Mass.:
386.4481
SMILES:
CCCCC#Cc1nc(N)c2ncn([C@@H]3C[C@H](NC(=O)CC)[C@@H](O)[C@H]3O)c2n1
: