Target
Phospholipase A-2-activating protein
Ligand
BDBM50237956
Substrate
Meas. Tech.
ChEMBL_610122 (CHEMBL1074487)
IC50
2000±n/a nM
Citation
 Lanier, MSergienko, ESimão, AMSu, YChung, TMillán, JLCashman, JR Design and synthesis of selective inhibitors of placental alkaline phosphatase. Bioorg Med Chem 18:573-9 (2010)  
Target
Name:
Phospholipase A-2-activating protein
Synonyms:
PLAA PLAP_HUMAN
Type:
PROTEIN
Mol. Mass.:
87154.11
Organism:
Homo sapiens (Human)
Description:
ChEMBL_610122
Residue:
795
  
Inhibitor
Name:
BDBM50237956
Synonyms:
1-(3,4-dihydroxyphenyl)-2-(1-(4-methoxyphenyl)-1H-tetrazol-5-ylthio)ethanone cid_1515366
Type:
Small organic molecule
Emp. Form.:
C16H14N4O4S
Mol. Mass.:
358.372
SMILES:
COc1ccc(cc1)-n1nnnc1SCC(=O)c1ccc(O)c(O)c1
: