Target
Phospholipase A-2-activating protein
Ligand
BDBM50309564
Substrate
Meas. Tech.
ChEMBL_610122 (CHEMBL1074487)
IC50
2500±n/a nM
Citation
 Lanier, MSergienko, ESimão, AMSu, YChung, TMillán, JLCashman, JR Design and synthesis of selective inhibitors of placental alkaline phosphatase. Bioorg Med Chem 18:573-9 (2010)  
Target
Name:
Phospholipase A-2-activating protein
Synonyms:
PLAA PLAP_HUMAN
Type:
PROTEIN
Mol. Mass.:
87154.11
Organism:
Homo sapiens (Human)
Description:
ChEMBL_610122
Residue:
795
  
Inhibitor
Name:
BDBM50309564
Synonyms:
1-(3,4-dihydroxyphenyl)-2-(4,6-dimethylpyrimidin-2-ylthio)ethanone cid_715454
Type:
Small organic molecule
Emp. Form.:
C14H14N2O3S
Mol. Mass.:
290.338
SMILES:
Cc1cc(C)nc(SCC(=O)c2ccc(O)c(O)c2)n1
: