Target
Phospholipase A-2-activating protein
Ligand
BDBM50309567
Substrate
Meas. Tech.
ChEMBL_610122 (CHEMBL1074487)
IC50
3000±n/a nM
Citation
 Lanier, MSergienko, ESimão, AMSu, YChung, TMillán, JLCashman, JR Design and synthesis of selective inhibitors of placental alkaline phosphatase. Bioorg Med Chem 18:573-9 (2010)  
Target
Name:
Phospholipase A-2-activating protein
Synonyms:
PLAA PLAP_HUMAN
Type:
PROTEIN
Mol. Mass.:
87154.11
Organism:
Homo sapiens (Human)
Description:
ChEMBL_610122
Residue:
795
  
Inhibitor
Name:
BDBM50309567
Synonyms:
3-(2-(3,4-dihydroxyphenyl)-2-oxoethyl)-6,7-dimethoxyisobenzofuran-1(3H)-one cid_2940433
Type:
Small organic molecule
Emp. Form.:
C18H16O7
Mol. Mass.:
344.3154
SMILES:
COc1ccc2C(CC(=O)c3ccc(O)c(O)c3)OC(=O)c2c1OC
: