Target
Phospholipase A-2-activating protein
Ligand
BDBM41888
Substrate
Meas. Tech.
ChEMBL_610122 (CHEMBL1074487)
IC50
4200±n/a nM
Citation
 Lanier, MSergienko, ESimão, AMSu, YChung, TMillán, JLCashman, JR Design and synthesis of selective inhibitors of placental alkaline phosphatase. Bioorg Med Chem 18:573-9 (2010)  
Target
Name:
Phospholipase A-2-activating protein
Synonyms:
PLAA PLAP_HUMAN
Type:
PROTEIN
Mol. Mass.:
87154.11
Organism:
Homo sapiens (Human)
Description:
ChEMBL_610122
Residue:
795
  
Inhibitor
Name:
BDBM41888
Synonyms:
1-(3,4-dihydroxyphenyl)-2-(2-ethyl-1-imidazolyl)ethanone;hydrochloride 1-[3,4-bis(oxidanyl)phenyl]-2-(2-ethylimidazol-1-yl)ethanone;hydrochloride ML095 cid_25067483
Type:
Small organic molecule
Emp. Form.:
C13H14N2O3
Mol. Mass.:
246.2619
SMILES:
CCc1nccn1CC(=O)c1ccc(O)c(O)c1
: