Target
Phospholipase A-2-activating protein
Ligand
BDBM46052
Substrate
Meas. Tech.
ChEMBL_610122 (CHEMBL1074487)
IC50
5800±n/a nM
Citation
 Lanier, MSergienko, ESimão, AMSu, YChung, TMillán, JLCashman, JR Design and synthesis of selective inhibitors of placental alkaline phosphatase. Bioorg Med Chem 18:573-9 (2010)  
Target
Name:
Phospholipase A-2-activating protein
Synonyms:
PLAA PLAP_HUMAN
Type:
PROTEIN
Mol. Mass.:
87154.11
Organism:
Homo sapiens (Human)
Description:
ChEMBL_610122
Residue:
795
  
Inhibitor
Name:
BDBM46052
Synonyms:
1-(3,4-dihydroxyphenyl)-2-(5,6-dimethyl-1-benzimidazolyl)ethanone;hydrochloride 1-[3,4-bis(oxidanyl)phenyl]-2-(5,6-dimethylbenzimidazol-1-yl)ethanone;hydrochloride MLS-0315851.0001 | cid_25067489
Type:
Small organic molecule
Emp. Form.:
C17H16N2O3
Mol. Mass.:
296.3205
SMILES:
Cc1cc2ncn(CC(=O)c3ccc(O)c(O)c3)c2cc1C
: