Target
Phospholipase A-2-activating protein
Ligand
BDBM46050
Substrate
Meas. Tech.
ChEMBL_610122 (CHEMBL1074487)
IC50
9100±n/a nM
Citation
 Lanier, MSergienko, ESimão, AMSu, YChung, TMillán, JLCashman, JR Design and synthesis of selective inhibitors of placental alkaline phosphatase. Bioorg Med Chem 18:573-9 (2010)  
Target
Name:
Phospholipase A-2-activating protein
Synonyms:
PLAA PLAP_HUMAN
Type:
PROTEIN
Mol. Mass.:
87154.11
Organism:
Homo sapiens (Human)
Description:
ChEMBL_610122
Residue:
795
  
Inhibitor
Name:
BDBM46050
Synonyms:
2-(1H-benzimidazol-2-ylamino)-1-(3,4-dihydroxyphenyl)ethanone;hydrochloride CHEMBL597837 cid_25067485
Type:
Small organic molecule
Emp. Form.:
C15H13N3O3
Mol. Mass.:
283.282
SMILES:
Oc1ccc(cc1O)C(=O)CNc1nc2ccccc2[nH]1
: