Target
Phospholipase A-2-activating protein
Ligand
BDBM46046
Substrate
Meas. Tech.
ChEMBL_610122 (CHEMBL1074487)
IC50
>100000±n/a nM
Citation
 Lanier, MSergienko, ESimão, AMSu, YChung, TMillán, JLCashman, JR Design and synthesis of selective inhibitors of placental alkaline phosphatase. Bioorg Med Chem 18:573-9 (2010)  
Target
Name:
Phospholipase A-2-activating protein
Synonyms:
PLAA PLAP_HUMAN
Type:
PROTEIN
Mol. Mass.:
87154.11
Organism:
Homo sapiens (Human)
Description:
ChEMBL_610122
Residue:
795
  
Inhibitor
Name:
BDBM46046
Synonyms:
2-(4,6-dimethylpyrimidin-2-yl)sulfanyl-1-(3-methoxy-4-oxidanyl-phenyl)ethanone;hydrochloride 2-[(4,6-dimethyl-2-pyrimidinyl)thio]-1-(4-hydroxy-3-methoxyphenyl)ethanone;hydrochloride CHEMBL596810 cid_25067475
Type:
Small organic molecule
Emp. Form.:
C15H16N2O3S
Mol. Mass.:
304.364
SMILES:
COc1cc(ccc1O)C(=O)CSc1nc(C)cc(C)n1
: