Target
Phospholipase A-2-activating protein
Ligand
BDBM46045
Substrate
Meas. Tech.
ChEMBL_610122 (CHEMBL1074487)
IC50
>100000±n/a nM
Citation
 Lanier, MSergienko, ESimão, AMSu, YChung, TMillán, JLCashman, JR Design and synthesis of selective inhibitors of placental alkaline phosphatase. Bioorg Med Chem 18:573-9 (2010)  
Target
Name:
Phospholipase A-2-activating protein
Synonyms:
PLAA PLAP_HUMAN
Type:
PROTEIN
Mol. Mass.:
87154.11
Organism:
Homo sapiens (Human)
Description:
ChEMBL_610122
Residue:
795
  
Inhibitor
Name:
BDBM46045
Synonyms:
1-(1,3-benzodioxol-5-yl)-2-(4,6-dimethylpyrimidin-2-yl)sulfanyl-ethanone;hydrochloride 1-(1,3-benzodioxol-5-yl)-2-[(4,6-dimethyl-2-pyrimidinyl)thio]ethanone;hydrochloride CHEMBL596811 cid_25067473
Type:
Small organic molecule
Emp. Form.:
C15H14N2O3S
Mol. Mass.:
302.348
SMILES:
Cc1cc(C)nc(SCC(=O)c2ccc3OCOc3c2)n1
: