Target
Phospholipase A-2-activating protein
Ligand
BDBM50309583
Substrate
Meas. Tech.
ChEMBL_610122 (CHEMBL1074487)
IC50
>100000±n/a nM
Citation
 Lanier, MSergienko, ESimão, AMSu, YChung, TMillán, JLCashman, JR Design and synthesis of selective inhibitors of placental alkaline phosphatase. Bioorg Med Chem 18:573-9 (2010)  
Target
Name:
Phospholipase A-2-activating protein
Synonyms:
PLAA PLAP_HUMAN
Type:
PROTEIN
Mol. Mass.:
87154.11
Organism:
Homo sapiens (Human)
Description:
ChEMBL_610122
Residue:
795
  
Inhibitor
Name:
BDBM50309583
Synonyms:
2-(4,6-dimethylpyrimidin-2-ylthio)-1-(4-methoxyphenyl)ethanone cid_694596
Type:
Small organic molecule
Emp. Form.:
C15H16N2O2S
Mol. Mass.:
288.365
SMILES:
COc1ccc(cc1)C(=O)CSc1nc(C)cc(C)n1
: