Target
Phospholipase A-2-activating protein
Ligand
BDBM50309584
Substrate
Meas. Tech.
ChEMBL_610122 (CHEMBL1074487)
IC50
>100000±n/a nM
Citation
 Lanier, MSergienko, ESimão, AMSu, YChung, TMillán, JLCashman, JR Design and synthesis of selective inhibitors of placental alkaline phosphatase. Bioorg Med Chem 18:573-9 (2010)  
Target
Name:
Phospholipase A-2-activating protein
Synonyms:
PLAA PLAP_HUMAN
Type:
PROTEIN
Mol. Mass.:
87154.11
Organism:
Homo sapiens (Human)
Description:
ChEMBL_610122
Residue:
795
  
Inhibitor
Name:
BDBM50309584
Synonyms:
CHEMBL599476 cid_25199543
Type:
Small organic molecule
Emp. Form.:
C14H15NO4
Mol. Mass.:
261.2732
SMILES:
Cc1cc(oc1C)C(=O)NCc1ccc(O)c(O)c1
: