Target
Phospholipase A-2-activating protein
Ligand
BDBM50309586
Substrate
Meas. Tech.
ChEMBL_610122 (CHEMBL1074487)
IC50
>100000±n/a nM
Citation
 Lanier, MSergienko, ESimão, AMSu, YChung, TMillán, JLCashman, JR Design and synthesis of selective inhibitors of placental alkaline phosphatase. Bioorg Med Chem 18:573-9 (2010)  
Target
Name:
Phospholipase A-2-activating protein
Synonyms:
PLAA PLAP_HUMAN
Type:
PROTEIN
Mol. Mass.:
87154.11
Organism:
Homo sapiens (Human)
Description:
ChEMBL_610122
Residue:
795
  
Inhibitor
Name:
BDBM50309586
Synonyms:
2-(5-(3-aminophenyl)-4-methyl-4H-1,2,4-triazol-3-ylthio)-1-phenylethanone cid_881297
Type:
Small organic molecule
Emp. Form.:
C17H16N4OS
Mol. Mass.:
324.4
SMILES:
Cn1c(SCC(=O)c2ccccc2)nnc1-c1cccc(N)c1
: