Target
Phospholipase A-2-activating protein
Ligand
BDBM41889
Substrate
Meas. Tech.
ChEMBL_610122 (CHEMBL1074487)
IC50
3300±n/a nM
Citation
 Lanier, MSergienko, ESimão, AMSu, YChung, TMillán, JLCashman, JR Design and synthesis of selective inhibitors of placental alkaline phosphatase. Bioorg Med Chem 18:573-9 (2010)  
Target
Name:
Phospholipase A-2-activating protein
Synonyms:
PLAA PLAP_HUMAN
Type:
PROTEIN
Mol. Mass.:
87154.11
Organism:
Homo sapiens (Human)
Description:
ChEMBL_610122
Residue:
795
  
Inhibitor
Name:
BDBM41889
Synonyms:
1-(3,4-dihydroxyphenyl)-2-(2-methyl-1-imidazolyl)ethanone;hydrochloride 1-[3,4-bis(oxidanyl)phenyl]-2-(2-methylimidazol-1-yl)ethanone;hydrochloride MLS-0315852.0001 | cid_25067491
Type:
Small organic molecule
Emp. Form.:
C12H12N2O3
Mol. Mass.:
232.2353
SMILES:
Cc1nccn1CC(=O)c1ccc(O)c(O)c1
: