Target
Phospholipase A-2-activating protein
Ligand
BDBM50241179
Substrate
Meas. Tech.
ChEMBL_610122 (CHEMBL1074487)
IC50
>5000±n/a nM
Citation
 Lanier, MSergienko, ESimão, AMSu, YChung, TMillán, JLCashman, JR Design and synthesis of selective inhibitors of placental alkaline phosphatase. Bioorg Med Chem 18:573-9 (2010)  
Target
Name:
Phospholipase A-2-activating protein
Synonyms:
PLAA PLAP_HUMAN
Type:
PROTEIN
Mol. Mass.:
87154.11
Organism:
Homo sapiens (Human)
Description:
ChEMBL_610122
Residue:
795
  
Inhibitor
Name:
BDBM50241179
Synonyms:
(S)-6-phenyl-2,3,5,6-tetrahydroimidazo[2,1-b]thiazole 6-Phenyl-2,3,5,6-tetrahydro-imidazo[2,1-b]thiazole (Levamisole) 6-Phenyl-2,3,5,6-tetrahydro-imidazo[2,1-b]thiazole(tetramisole) LEVAMISOLE TCMDC-125847 levamisole;6-Phenyl-2,3,5,6-tetrahydro-imidazo[2,1-b]thiazole | tetramisole;6-Phenyl-2,3,5,6-tetrahydro-imidazo[2,1-b]thiazole
Type:
Small organic molecule
Emp. Form.:
C11H12N2S
Mol. Mass.:
204.291
SMILES:
C1CN2C[C@@H](N=C2S1)c1ccccc1
: