Target
Phospholipase A-2-activating protein
Ligand
BDBM50309587
Substrate
Meas. Tech.
ChEMBL_610122 (CHEMBL1074487)
IC50
>5000±n/a nM
Citation
 Lanier, MSergienko, ESimão, AMSu, YChung, TMillán, JLCashman, JR Design and synthesis of selective inhibitors of placental alkaline phosphatase. Bioorg Med Chem 18:573-9 (2010)  
Target
Name:
Phospholipase A-2-activating protein
Synonyms:
PLAA PLAP_HUMAN
Type:
PROTEIN
Mol. Mass.:
87154.11
Organism:
Homo sapiens (Human)
Description:
ChEMBL_610122
Residue:
795
  
Inhibitor
Name:
BDBM50309587
Synonyms:
CHEMBL598548 LEUCINE AMIDE
Type:
Small organic molecule
Emp. Form.:
C6H14N2O
Mol. Mass.:
130.1882
SMILES:
CC(C)C[C@H](N)C(N)=O
: