Target
Phospholipase A-2-activating protein
Ligand
BDBM50309588
Substrate
Meas. Tech.
ChEMBL_610122 (CHEMBL1074487)
IC50
>5000±n/a nM
Citation
 Lanier, MSergienko, ESimão, AMSu, YChung, TMillán, JLCashman, JR Design and synthesis of selective inhibitors of placental alkaline phosphatase. Bioorg Med Chem 18:573-9 (2010)  
Target
Name:
Phospholipase A-2-activating protein
Synonyms:
PLAA PLAP_HUMAN
Type:
PROTEIN
Mol. Mass.:
87154.11
Organism:
Homo sapiens (Human)
Description:
ChEMBL_610122
Residue:
795
  
Inhibitor
Name:
BDBM50309588
Synonyms:
CHEMBL589752 | L-homoarginine
Type:
Small organic molecule
Emp. Form.:
C7H16N4O2
Mol. Mass.:
188.2275
SMILES:
[#7]-[#6@@H](-[#6]-[#6]-[#6]-[#6]\[#7]=[#6](/[#7])-[#7])-[#6](-[#8])=O
: