Target
Phospholipase A-2-activating protein
Ligand
BDBM50219348
Substrate
Meas. Tech.
ChEMBL_610122 (CHEMBL1074487)
IC50
>5000±n/a nM
Citation
 Lanier, MSergienko, ESimão, AMSu, YChung, TMillán, JLCashman, JR Design and synthesis of selective inhibitors of placental alkaline phosphatase. Bioorg Med Chem 18:573-9 (2010)  
Target
Name:
Phospholipase A-2-activating protein
Synonyms:
PLAA PLAP_HUMAN
Type:
PROTEIN
Mol. Mass.:
87154.11
Organism:
Homo sapiens (Human)
Description:
ChEMBL_610122
Residue:
795
  
Inhibitor
Name:
BDBM50219348
Synonyms:
(2S)-2-amino-4-methylpentanoic acid (S)-leucine L-Leucin L-leucine
Type:
Small organic molecule
Emp. Form.:
C6H13NO2
Mol. Mass.:
131.1729
SMILES:
CC(C)C[C@H](N)C(O)=O
: