Target
Sodium- and chloride-dependent glycine transporter 1
Ligand
BDBM50309960
Substrate
Meas. Tech.
ChEMBL_612178 (CHEMBL1073598)
Ki
1.7±n/a nM
Citation
 Lowe, JADeninno, SLDrozda, SESchmidt, CJWard, KMDavid Tingley, FSanner, MTunucci, DValentine, J An octahydro-cyclopenta[c]pyrrole series of inhibitors of the type 1 glycine transporter. Bioorg Med Chem Lett 20:907-11 (2010)  
Target
Name:
Sodium- and chloride-dependent glycine transporter 1
Synonyms:
GlyT-1 Glycine Transporters (GlyT1c) SC6A9_HUMAN Sodium- and chloride-dependent glycine transporter 1 Sodium- and chloride-dependent glycine transporter 1 (GlyT1c) Solute carrier family 6 member 9
Type:
Enzyme
Mol. Mass.:
78270.54
Organism:
Homo sapiens (Human)
Description:
P48067
Residue:
706
  
Inhibitor
Name:
BDBM50309960
Synonyms:
(exo)-1-Methyl-1H-imidazole-4-carboxylic acid(3-trifluoromethyl, 4-fluorobenzyl)-(octahydro-cyclopenta[c]pyrrol-5-yl)-amide | CHEMBL596699
Type:
Small organic molecule
Emp. Form.:
C20H22F4N4O
Mol. Mass.:
410.4085
SMILES:
Cn1cnc(c1)C(=O)N(Cc1ccc(F)c(c1)C(F)(F)F)[C@@H]1C[C@@H]2CNC[C@@H]2C1
: