Target
Cannabinoid receptor 1
Ligand
BDBM50309993
Substrate
Meas. Tech.
ChEMBL_612189 (CHEMBL1074127)
IC50
4.9±n/a nM
Citation
 Seo, HJKim, MJLee, SHLee, SHJung, MEKim, MSAhn, KKim, JLee, J Synthesis and structure-activity relationship of 1,2,4-triazole-containing diarylpyrazolyl carboxamide as CB1 cannabinoid receptor-ligand. Bioorg Med Chem 18:1149-62 (2010)  
Target
Name:
Cannabinoid receptor 1
Synonyms:
Brain-type cannabinoid receptor CB-R CNR1_RAT Cannabinoid receptor Cnr1 | Skr6
Type:
G Protein-Coupled Receptor (GPCR)
Mol. Mass.:
52856.55
Organism:
Rattus norvegicus (rat)
Description:
P20272
Residue:
473
  
Inhibitor
Name:
BDBM50309993
Synonyms:
4-((1H-1,2,4-Triazol-1-yl)methyl)-N-tert-butyl-5-(4-chlorophenyl)-1-(2,4-dichlorophenyl)-1H-pyrazole-3-carboxamide | CHEMBL604925
Type:
Small organic molecule
Emp. Form.:
C23H21Cl3N6O
Mol. Mass.:
503.811
SMILES:
CC(C)(C)NC(=O)c1nn(c(c1Cn1cncn1)-c1ccc(Cl)cc1)-c1ccc(Cl)cc1Cl
: