Target
cAMP-specific 3',5'-cyclic phosphodiesterase 4D
Ligand
BDBM50310213
Substrate
Meas. Tech.
ChEMBL_607913 (CHEMBL1066241)
IC50
30±n/a nM
Citation
 Kim, ISong, JHPark, CMJeong, JWKim, HRHa, JRNo, ZHyun, YLCho, YSSook Kang, NJeon, DJ Design, synthesis, and evaluation of 2-aryl-7-(3',4'-dialkoxyphenyl)-pyrazolo[1,5-a]pyrimidines as novel PDE-4 inhibitors. Bioorg Med Chem Lett 20:922-6 (2010)  
Target
Name:
cAMP-specific 3',5'-cyclic phosphodiesterase 4D
Synonyms:
3',5'-cyclic phosphodiesterase PDE43 PDE4D_HUMAN | Phosphodiesterase 4D
Type:
Protein
Mol. Mass.:
91092.69
Organism:
Homo sapiens (Human)
Description:
Q08499
Residue:
809
  
Inhibitor
Name:
BDBM50310213
Synonyms:
7-(3'-Cyclopentyloxy-4'-methoxyphenyl)-2-(2,5-dichlorophenyl)pyrazolo[1,5-a]pyrimidine | CHEMBL606214
Type:
Small organic molecule
Emp. Form.:
C24H21Cl2N3O2
Mol. Mass.:
454.348
SMILES:
COc1ccc(cc1OC1CCCC1)-c1ccnc2cc(nn12)-c1cc(Cl)ccc1Cl
: