Target
Matrix metalloproteinase-9
Ligand
BDBM50240460
Substrate
Meas. Tech.
ChEMBL_607931 (CHEMBL1066259)
IC50
53200±n/a nM
Citation
 Moon, HIKim, TICho, HSKim, EK Identification of potential and selective collagenase, gelatinase inhibitors from Crataegus pinnatifida. Bioorg Med Chem Lett 20:991-3 (2010)  
Target
Name:
Matrix metalloproteinase-9
Synonyms:
67 kDa matrix metalloproteinase-9 92 kDa gelatinase CLG4B Gelatinase B MMP9 Matrix metalloproteinase 9 (MMP-9) Matrix metalloproteinase-9 (MMP9)
Type:
Enzyme
Mol. Mass.:
78452.28
Organism:
Homo sapiens (Human)
Description:
P14780
Residue:
707
  
Inhibitor
Name:
BDBM50240460
Synonyms:
(2R,3R,4R,2'R,3'R,4'S,2''R,3''R)-2,2',2''-Tris-(3,4-dihydroxy-phenyl)-3,4,3',4',3'',4''-hexahydro-2H,2'H,2''H-[4,8';4',8'']terchromene-3,5,7,3',5',7',3'',5'',7''-nonaol Procyanidin C-1 epicatechin-(4beta->8)-epicatechin-(4beta->8)-epicatechin
Type:
Small organic molecule
Emp. Form.:
C45H38O18
Mol. Mass.:
866.7724
SMILES:
O[C@@H]1Cc2c(O)cc(O)c([C@@H]3[C@@H](O)[C@H](Oc4c([C@@H]5[C@@H](O)[C@H](Oc6cc(O)cc(O)c56)c5ccc(O)c(O)c5)c(O)cc(O)c34)c3ccc(O)c(O)c3)c2O[C@@H]1c1ccc(O)c(O)c1
: