Target
Rho-associated protein kinase 1
Ligand
BDBM50310455
Substrate
Meas. Tech.
ChEMBL_619401 (CHEMBL1104159)
Ki
450±n/a nM
Citation
 Bandarage, UHare, BParsons, JPham, LMarhefka, CBemis, GTang, QMoody, CSRodems, SShah, SAdams, CBravo, JCharonnet, ESavic, VCome, JHGreen, J 4-(Benzimidazol-2-yl)-1,2,5-oxadiazol-3-ylamine derivatives: potent and selective p70S6 kinase inhibitors. Bioorg Med Chem Lett 19:5191-4 (2009)  
Target
Name:
Rho-associated protein kinase 1
Synonyms:
ROCK-I ROCK1_HUMAN Rho-associated protein kinase Rho-associated, coiled-coil-containing protein kinase 1 Rho-kinase (ROCK I) p160 ROCK-1 | p160ROCK
Type:
Serine/threonine-protein kinase
Mol. Mass.:
158156.77
Organism:
Homo sapiens (Human)
Description:
Q13464
Residue:
1354
  
Inhibitor
Name:
BDBM50310455
Synonyms:
4-(1-cyclopropyl-1H-benzo[d]imidazol-2-yl)-1,2,5-oxadiazol-3-amine | CHEMBL1079293
Type:
Small organic molecule
Emp. Form.:
C12H11N5O
Mol. Mass.:
241.2486
SMILES:
Nc1nonc1-c1nc2ccccc2n1C1CC1
: