Target
C-X-C chemokine receptor type 3
Ligand
BDBM50310487
Substrate
Meas. Tech.
ChEMBL_619420 (CHEMBL1104178)
IC50
0.6±n/a nM
Citation
 Liu, JFu, ZLi, ARJohnson, MZhu, LMarcus, ADanao, JSullivan, TTonn, GCollins, TMedina, J Optimization of a series of quinazolinone-derived antagonists of CXCR3. Bioorg Med Chem Lett 19:5114-8 (2009)  
Target
Name:
C-X-C chemokine receptor type 3
Synonyms:
AAO92295.1 C-X-C chemokine receptor type 3 (CXCR3) CXCR3 CXCR3_HUMAN chemokine (C-X-C motif) receptor 3
Type:
Enzyme Catalytic Domain
Mol. Mass.:
40665.65
Organism:
Homo sapiens (Human)
Description:
Residue:
368
  
Inhibitor
Name:
BDBM50310487
Synonyms:
(R)-N-(2-(ethylsulfonyl)ethyl)-2-(4-fluoro-3-(trifluoromethyl)phenyl)-N-(1-(4-oxo-3-(4-(2,2,2-trifluoroethoxy)phenyl)-3,4-dihydropyrido[2,3-d]pyrimidin-2-yl)ethyl)acetamide | CHEMBL1077831
Type:
Small organic molecule
Emp. Form.:
C30H27F7N4O5S
Mol. Mass.:
688.613
SMILES:
CCS(=O)(=O)CCN([C@H](C)c1nc2ncccc2c(=O)n1-c1ccc(OCC(F)(F)F)cc1)C(=O)Cc1ccc(F)c(c1)C(F)(F)F
: