Target
Aurora kinase B
Ligand
BDBM50310618
Substrate
Meas. Tech.
ChEMBL_620386 (CHEMBL1112281)
IC50
620±n/a nM
Citation
 Zhong, MBui, MShen, WBaskaran, SAllen, DAElling, RAFlanagan, WMFung, ADHanan, EJHarris, SOHeumann, SAHoch, UIvy, SNJacobs, JWLam, SLee, HMcDowell, RSOslob, JDPurkey, HERomanowski, MJSilverman, JATangonan, BTTaverna, PYang, WYoburn, JCYu, CHZimmerman, KMO'Brien, TLew, W 2-Aminobenzimidazoles as potent Aurora kinase inhibitors. Bioorg Med Chem Lett 19:5158-61 (2009)  
Target
Name:
Aurora kinase B
Synonyms:
AIK2 AIM1 ARK2 AURKB_HUMAN Aurora B-INCENP Aurora kinase B (AURKB) STK-1 STK12 Serine/threonine-protein kinase aurora B
Type:
Protein
Mol. Mass.:
39327.72
Organism:
Homo sapiens (Human)
Description:
Q96GD4
Residue:
344
  
Inhibitor
Name:
BDBM50310618
Synonyms:
CHEMBL1078828 | N-(2-(2-(6-(trifluoromethyl)-1H-benzo[d]imidazol-2-ylamino)thiazol-5-yl)ethyl)thieno[3,2-d]pyrimidin-4-amine
Type:
Small organic molecule
Emp. Form.:
C19H14F3N7S2
Mol. Mass.:
461.487
SMILES:
FC(F)(F)c1ccc2nc(Nc3ncc(CCNc4ncnc5ccsc45)s3)[nH]c2c1
: