Target
Aurora kinase A
Ligand
BDBM26326
Substrate
Meas. Tech.
ChEMBL_620385 (CHEMBL1112280)
IC50
9±n/a nM
Citation
 Zhong, MBui, MShen, WBaskaran, SAllen, DAElling, RAFlanagan, WMFung, ADHanan, EJHarris, SOHeumann, SAHoch, UIvy, SNJacobs, JWLam, SLee, HMcDowell, RSOslob, JDPurkey, HERomanowski, MJSilverman, JATangonan, BTTaverna, PYang, WYoburn, JCYu, CHZimmerman, KMO'Brien, TLew, W 2-Aminobenzimidazoles as potent Aurora kinase inhibitors. Bioorg Med Chem Lett 19:5158-61 (2009)  
Target
Name:
Aurora kinase A
Synonyms:
AIK ARK-1 AURA AURKA_HUMAN Aurora 2 Aurora kinase A (AURKA) Aurora kinase A (Aurora-2) Aurora/IPL1-related kinase 1 Breast tumor-amplified kinase IAK1 STK15 GN Serine/threonine kinase 15 Serine/threonine-protein kinase 6 Serine/threonine-protein kinase aurora-A aurora-2 | hARK1
Type:
Serine/threonine-protein kinase
Mol. Mass.:
45830.98
Organism:
Homo sapiens (Human)
Description:
O14965
Residue:
403
  
Inhibitor
Name:
BDBM26326
Synonyms:
1-(3-chlorophenyl)-3-[5-(2-{thieno[3,2-d]pyrimidin-4-ylamino}ethyl)-1,3-thiazol-2-yl]urea | SN-314
Type:
Small organic molecule
Emp. Form.:
C18H15ClN6OS2
Mol. Mass.:
430.934
SMILES:
Clc1cccc(NC(=O)Nc2ncc(CCNc3ncnc4ccsc34)s2)c1
: