Target
Cytochrome P450 3A4
Ligand
BDBM50310805
Substrate
Meas. Tech.
ChEMBL_621478 (CHEMBL1100149)
IC50
10000±n/a nM
Citation
 Shen, HCDing, FXDeng, QXu, SChen, HSTong, XTong, VZhang, XChen, YZhou, GPai, LYAlonso-Galicia, MZhang, BRoy, STata, JRBerger, JPColletti, SL Discovery of 3,3-disubstituted piperidine-derived trisubstituted ureas as highly potent soluble epoxide hydrolase inhibitors. Bioorg Med Chem Lett 19:5314-20 (2009)  
Target
Name:
Cytochrome P450 3A4
Synonyms:
Albendazole monooxygenase CP3A4_HUMAN CYP3A4 CYPIIIA4 Cytochrome P450 3A4 (CYP3A4) Nifedipine oxidase Taurochenodeoxycholate 6-alpha-hydroxylase
Type:
Enzyme
Mol. Mass.:
57349.57
Organism:
Homo sapiens (Human)
Description:
Residue:
503
  
Inhibitor
Name:
BDBM50310805
Synonyms:
CHEMBL1079246 | N-(4-chlorophenyl)-3-(3-(methylamino)-3-oxopropyl)-3-phenylpiperidine-1-carboxamide
Type:
Small organic molecule
Emp. Form.:
C22H26ClN3O2
Mol. Mass.:
399.914
SMILES:
CNC(=O)CCC1(CCCN(C1)C(=O)Nc1ccc(Cl)cc1)c1ccccc1
: