Target
Cytochrome P450 3A4
Ligand
BDBM50310826
Substrate
Meas. Tech.
ChEMBL_621523 (CHEMBL1108441)
IC50
130±n/a nM
Citation
 César, TBManthey, JAMyung, K Minor furanocoumarins and coumarins in grapefruit peel oil as inhibitors of human cytochrome P450 3A4. J Nat Prod 72:1702-4 (2009)  
Target
Name:
Cytochrome P450 3A4
Synonyms:
Albendazole monooxygenase CP3A4_HUMAN CYP3A4 CYPIIIA4 Cytochrome P450 3A4 (CYP3A4) Nifedipine oxidase Taurochenodeoxycholate 6-alpha-hydroxylase
Type:
Enzyme
Mol. Mass.:
57349.57
Organism:
Homo sapiens (Human)
Description:
Residue:
503
  
Inhibitor
Name:
BDBM50310826
Synonyms:
6',7'-Dihydroxybergamottin Octanal Acetal | CHEMBL1078189
Type:
Small organic molecule
Emp. Form.:
C29H38O6
Mol. Mass.:
482.6084
SMILES:
CCCCCCCC1O[C@H](CC\C(C)=C\COc2c3ccoc3cc3oc(=O)ccc23)C(C)(C)O1
: