Target
Somatostatin receptor type 3
Ligand
BDBM50311334
Substrate
Meas. Tech.
ChEMBL_621604 (CHEMBL1113036)
Ki
>10000±n/a nM
Citation
 Martin, REMohr, PMaerki, HPGuba, WKuratli, CGavelle, OBinggeli, ABendels, SAlvarez-Sánchez, RAlker, APolonchuk, LChrist, AD Benzoxazole piperidines as selective and potent somatostatin receptor subtype 5 antagonists. Bioorg Med Chem Lett 19:6106-13 (2009)  
Target
Name:
Somatostatin receptor type 3
Synonyms:
SOMATOSTATIN SST3 SS3-R SSR-28 SSTR3 | Somatostatin receptor type 3 (SSTR3)
Type:
Protein
Mol. Mass.:
45855.97
Organism:
Homo sapiens (Human)
Description:
P32745
Residue:
418
  
Inhibitor
Name:
BDBM50311334
Synonyms:
2-(1-(4-chloro-3,5-diethoxybenzyl)piperidin-4-ylamino)benzo[d]oxazole-5-carboxylic acid | CHEMBL1080585
Type:
Small organic molecule
Emp. Form.:
C24H28ClN3O5
Mol. Mass.:
473.949
SMILES:
CCOc1cc(CN2CCC(CC2)Nc2nc3cc(ccc3o2)C(O)=O)cc(OCC)c1Cl
: