Target
RAC-gamma serine/threonine-protein kinase
Ligand
BDBM50311407
Substrate
Meas. Tech.
ChEMBL_622266 (CHEMBL1110411)
IC50
4600±n/a nM
Citation
 Enkvist, EKriisa, MRoben, MKadak, GRaidaru, GUri, A Effect of the structure of adenosine mimic of bisubstrate-analog inhibitors on their activity towards basophilic protein kinases. Bioorg Med Chem Lett 19:6098-101 (2009)  
Target
Name:
RAC-gamma serine/threonine-protein kinase
Synonyms:
AKT3 PKB gamma Protein kinase Akt-3 Protein kinase B, gamma RAC-gamma serine/threonine-protein kinase Serine/threonine-protein kinase AKT | Serine/threonine-protein kinase AKT3
Type:
Enzyme
Mol. Mass.:
55769.36
Organism:
Homo sapiens (Human)
Description:
Residue:
479
  
Inhibitor
Name:
BDBM50311407
Synonyms:
CHEMBL1077371 | N-((6R,9R,19R)-1-amino-19-(4-aminobutyl)-6-carbamoyl-9-(3-guanidinopropyl)-1-imino-8,11,18,21-tetraoxo-2,7,10,17,20-pentaazahexacosan-26-yl)-3-(2-aminopyrimidin-4-yl)benzamide
Type:
Small organic molecule
Emp. Form.:
C41H68N16O6
Mol. Mass.:
881.0822
SMILES:
[#7]-[#6]-[#6]-[#6]-[#6]-[#6@@H](-[#7]-[#6](=O)-[#6]-[#6]-[#6]-[#6]-[#6]-[#7]-[#6](=O)-c1cccc(c1)-c1ccnc(-[#7])n1)-[#6](=O)-[#7]-[#6]-[#6]-[#6]-[#6]-[#6]-[#6](=O)-[#7]-[#6@H](-[#6]-[#6]-[#6]\[#7]=[#6](\[#7])-[#7])-[#6](=O)-[#7]-[#6@H](-[#6]-[#6]-[#6]\[#7]=[#6](\[#7])-[#7])-[#6](-[#7])=O
: