Target
Tyrosine-protein kinase JAK2
Ligand
BDBM50311644
Substrate
Meas. Tech.
ChEMBL_618678 (CHEMBL1102456)
IC50
28±n/a nM
Citation
 Cole, AGBohnstedt, ACParadkar, VKingsbury, CQuintero, JGPark, HLu, YYou, MNeagu, IDiller, DJLetourneau, JJShao, YJames, RARiviello, CMHo, KKLin, THWang, BAppell, KCSills, MQuadros, EKimble, EFOhlmeyer, MHWebb, ML 2-Benzimidazolyl-9-(chroman-4-yl)-purinone derivatives as JAK3 inhibitors. Bioorg Med Chem Lett 19:6788-92 (2009)  
Target
Name:
Tyrosine-protein kinase JAK2
Synonyms:
JAK-2 JAK2_HUMAN Janus kinase 2 (JAK2) | Janus kinase 2 (a protein tyrosine kinase)
Type:
Protein
Mol. Mass.:
130684.68
Organism:
Homo sapiens (Human)
Description:
O60674
Residue:
1132
  
Inhibitor
Name:
BDBM50311644
Synonyms:
1-(9-(2,6-difluorobenzyl)-8-oxo-8,9-dihydro-7H-purin-2-yl)-1H-benzo[d]imidazole-6-carbonitrile | CHEMBL1079523
Type:
Small organic molecule
Emp. Form.:
C20H11F2N7O
Mol. Mass.:
403.3444
SMILES:
Fc1cccc(F)c1Cn1c2nc(ncc2[nH]c1=O)-n1cnc2ccc(cc12)C#N
: