Target
Cytochrome P450 2C19
Ligand
BDBM50311759
Substrate
Meas. Tech.
ChEMBL_619262 (CHEMBL1100429)
IC50
6400±n/a nM
Citation
 Panchal, TBailey, NBamford, MDemont, EElliott, RFarre-Gutierrez, IGarton, NHayhow, THutley, GNaylor, A Evaluation of basic, heterocyclic ring systems as templates for use as potassium competitive acid blockers (pCABs). Bioorg Med Chem Lett 19:6813-7 (2009)  
Target
Name:
Cytochrome P450 2C19
Synonyms:
(R)-limonene 6-monooxygenase (S)-limonene 7-monooxygenase CYP2C19 CYPIIC19 Cytochrome P450 2C19 [I331V] Cytochrome P450-254C Mephenytoin 4-hydroxylase P450-254C
Type:
Enzyme
Mol. Mass.:
55935.47
Organism:
Homo sapiens (Human)
Description:
P33261
Residue:
490
  
Inhibitor
Name:
BDBM50311759
Synonyms:
1-(7-(2,6-dimethylbenzylamino)-2,3-dimethyl-1H-pyrrolo[2,3-c]pyridin-5-yl)pyrrolidin-2-one | CHEMBL1076245
Type:
Small organic molecule
Emp. Form.:
C22H26N4O
Mol. Mass.:
362.468
SMILES:
Cc1[nH]c2c(NCc3c(C)cccc3C)nc(cc2c1C)N1CCCC1=O
: